{"text_format":"1","workbook":"xlsx","n_sheets":15,"sheets":["Read me","Document History","Report (Screening)","Report (Realistic worst case)","Report (WCCE)","Calc (Screening)","Calc (Realistic worst case)","Calc (WCCE)","Defaults 1","Defaults 2","Defaults 3","Defaults 4","Defaults 5 Food Cons.","Defaults 6 LogP_OW","Refinement Notes Inhalation "],"not_rendered":{"charts":0,"images":15,"macros":1,"external_links":0,"defined_names":2,"comments":0,"pivot_tables":0},"unopened":[],"bounds":{"document_bytes":16777216,"sheet_cells":100000,"rows_first":2000,"rows_last":500,"rows_between":2000,"halvings":0,"cell_chars":16384,"cell_head_chars":4096},"cells_cut":0,"cells_raw":0,"read":"whole","date_system":"1900"}

{"sheet":"Read me","index":0,"n_rows":85,"n_cols":1,"rows_kept":85,"cut":false,"hidden":false,"merged":[]}
["Introduction"]
["This calculator presents a tool to facilitate the estimation of external livestock exposure to biocidal active substances as described in the Guidance on the Biocidal Products Regulation, Vol III Parts B+C, Section 6: Guidance on estimating livestock exposure (1). In addition, it allows estimation of the worst-case consumer exposure (WCCE) from the calculated external livestock exposure as explained in the EMA-CVMP Guideline on risk characterisation and assessment of maximum residue limits (MRL) for biocides (2). This calculator applies assumptions and default values as given in both guidance documents. For references and explanations on these values please refer to the respective guidance document (1, 2). "]
[]
["Section 6 of the Guidance on BPR (1) focusses on external exposure assessment of livestock animals. In an initial screening step it is assumed that the entire amount of biocidal product applied is taken up by animals regardless of the route of exposure. The result of the exposure estimate is compared to a pre-defined threshold of concern. If this trigger value (0.004 mg a.s./kg bw/d) is exceeded a realistic worst-case estimate (RWCE) should be performed for each relevant route of exposure (oral/dermal/inhalative) taking into account the fraction of applied product available for each route. The results for each route of exposure estimates are then added up to arrive at a total exposure value. \nIf the trigger value (0.004 mg a.s./kg bw/d) is still exceeded it should be considered whether further refinement of the RWCE is possible. Such refinements may include the use of more realistic calculation models (e.g. ConsExpo model (3) for estimation of inhalative exposure, see information on spreadsheet \"Refinement Notes Inhalation\") or the application of additional risk mitigation measures (e.g. rinsing of treated surfaces).\nIn case the realistic worst-case estimate cannot be further refined to reduce the estimated exposure level below the trigger value, the worst-case consumer exposure (WCCE) should be estimated and compared to the acceptable daily intake (ADI) and /or the acute reference dose (ARfD). The process for estimating WCCE is described in the EMA-CVMP Guideline (2). Initially it is assumed that the estimated external livestock exposure reflects the internal livestock exposure. In the absence of more substance specific data, empirical transfer factors (based on the log PO/W) may be considered to estimate the maximum transfer of an external oral dose to livestock edible tissues (4). "]
[]
["Both, screening and realistic worst-case estimates, are based on information on the intended use and on a set of default values. Please note that the use of this calculator requires expert judgement with regard to choice of scenario, application of assumptions and default values. It does not give a ready-to-use report with results but merely facilitates the execution of calculations for all animal species. "]
{"$rows_left_out":80}
{"sheet":"Document History","index":1,"n_rows":6,"n_cols":3,"rows_kept":6,"cut":false,"hidden":false,"merged":[[0,0,0,2]]}
["BfR Calculator for estimating livestock exposure \nto active substances used in biocidal products"]
[]
["Document History"]
["Version","Comment","Date"]
["Version 1.0","First edition\n\n","20.02.2012"]
["Version 2.0","(1) Addition of spreadsheets for worst-case consumer exposure (WCCE) (\"Report (WCCE)\" and \"Calc (WCCE)\")\n(2) Addition of spreadsheet for food consumption default data (chronic and acute)(\"Defaults 5 Food Cons.\")\n(3) Addition of spreadsheet for transfer factors based on the octanol–water partition coefficient (LogPOW)(\"Defaults 6 LogP_OW\")\n(4) Addition of spreadsheet for refinement of inhalation exposure estimate for livestock animals using ConsExpo Web (\"Refinement Notes Inhalation\")\n(5) Update and correct defaults to be in line with the finalized Guidance on the Biocidal Products Regulation, Vol III Parts B+C (Version 4.0, December 2017)\n a) Correction of default values as listed in Appendix 6-1 (note mistake 0.3 cm rabbits! corrected to 30 cm)\n b) Default values for transport of rabbits extracted from reference given in finalised livestock guidance\n(6) Update Screening calculations and addition of the scenario \"Treatment of packaging material for feed\" and distinction between \"Direct treatment of livestock animals -  teat dip (dermal absorption)\" and \"Direct treatment of livestock animals -  teat dip (residues in milk)\n(7) Update RWCE calculations and additon of unit converter for temperature and vapour pressure\n\n","23.07.2021"]
{"$rows_left_out":1}
{"sheet":"Report (Screening)","index":2,"n_rows":181,"n_cols":7,"rows_kept":181,"cut":false,"hidden":false,"merged":[]}
["Input"]
["Choose scenario, enter maximal application rate and press \"Generate Report\". "]
["*optional information may be given in yellow boxes"]
[]
[null,"Biocidal product*","<enter product name>"]
[null,"Product type*","<choose product type>"]
{"$rows_left_out":176}
{"sheet":"Report (Realistic worst case)","index":3,"n_rows":189,"n_cols":7,"rows_kept":189,"cut":false,"hidden":false,"merged":[[29,1,29,2]]}
["Input"]
["Choose scenario(s), enter required information in the highlighted boxes and press \"Generate Report\". "]
["*Optional information may be given in yellow boxes"]
["** For refinement of the exposure model a factor may be applied on a case-by-case basis"]
[]
[null,"Biocidal product*","<enter product name>"]
{"$rows_left_out":184}
{"sheet":"Report (WCCE)","index":4,"n_rows":117,"n_cols":9,"rows_kept":117,"cut":false,"hidden":false,"merged":[[28,7,29,7],[28,8,29,8],[28,0,29,0],[30,0,31,0],[33,7,34,7],[33,8,34,8],[30,7,31,7],[30,8,31,8],[26,0,27,0],[24,0,25,0],[17,0,17,13],[15,0,15,13],[16,0,16,13],[18,0,18,13],[24,7,25,7],[24,8,25,8],[67,0,68,0],[67,7,68,7],[67,8,68,8],[54,0,54,13],[33,0,34,0],[52,0,52,13],[53,0,53,13],[8,0,8,13],[62,0,63,0],[62,7,63,7],[62,8,63,8],[64,0,65,0],[64,7,65,7],[64,8,65,8],[58,0,59,0],[58,7,59,7],[58,8,59,8],[60,0,61,0],[60,7,61,7],[60,8,61,8],[26,7,27,7],[26,8,27,8],[21,0,21,6]]}
["Input"]
["*If ARfD is not considered necessary leave blank. If the ARfD has not been assessed enter ADI.\n\n\n"]
[]
[null,null,null,"Unit","Source"]
[null,"ADI",null,"mg/kg bw/day"]
[null,"ARfD*",null,"mg/kg bw/day"]
{"$rows_left_out":112}
{"sheet":"Calc (Screening)","index":5,"n_rows":37,"n_cols":25,"rows_kept":37,"cut":false,"hidden":false,"merged":[]}
["Screening (mg a.s./kg bw/d)"]
["The screening step assumes that the entire amount of biocidal product applied is taken up by animals regardless of the route of exposure."]
[]
["Animal Species",null,"Surface treatment of animal housing","Surface treatment of animal housing (floor&wall of stable without partitions)","Surface treatment of animal housing (floor only)","Surface treatment of animal housing (wall only)","Space treatment of animal housing","Surface treatment of transport vehicles","Space treatment of transport vehicles","Treatment of feed","Treatment of drinking water ","Surface treatment of storage facilities for feedstuff (silo type #1)","Surface treatment of storage facilities for feedstuff (silo type #2)","Surface treatment of storage facilities for feedstuff (silo type #3)","Surface treatment of storage facilities for feedstuff (silo type #4)","Space treatment of storage facilities for feedstuff (silo type #1)","Space treatment of storage facilities for feedstuff (silo type #2)","Space treatment of storage facilities for feedstuff (silo type #3)","Space treatment of storage facilities for feedstuff (silo type #4)","Direct treatment of livestock animals -  teat dip (dermal absorption)","Direct treatment of livestock animals -  teat dip (residues in milk)","Direct treatment of livestock animals - hoof disinfection","Direct treatment of livestock animals -   ear tags","Direct exposure of an individual livestock animal ","Treatment of packaging material for feed"]
["Beef cattle",null,{"$f":"'Report (Screening)'!$C$15*'Defaults 2'!J6/'Defaults 1'!B6","v":0},{"$f":"'Report (Screening)'!$C$15*'Defaults 2'!E6/'Defaults 2'!C6/'Defaults 1'!B6","v":0},{"$f":"'Report (Screening)'!$C$15*'Defaults 2'!D6/'Defaults 2'!C6/'Defaults 1'!B6","v":0},{"$f":"'Report (Screening)'!$C$15*('Defaults 2'!E6-'Defaults 2'!D6)/'Defaults 2'!C6/'Defaults 1'!B6","v":0},{"$f":"'Report (Screening)'!$C$15*'Defaults 2'!F6/'Defaults 2'!C6/'Defaults 1'!B6","v":0},{"$f":"'Report (Screening)'!$C$15*'Defaults 3'!L6/'Defaults 1'!B6","v":0},{"$f":"'Report (Screening)'!$C$15*'Defaults 3'!M6/'Defaults 1'!B6","v":0},{"$f":"'Report (Screening)'!$C$15*'Defaults 1'!J6/'Defaults 1'!B6","v":0},{"$f":"'Report (Screening)'!$C$15*'Defaults 1'!K6/'Defaults 1'!B6","v":0},{"$f":"'Report (Screening)'!$C$15*'Defaults 4'!$C$13/('Defaults 4'!$C$12*1000)*'Defaults 1'!J6/'Defaults 1'!B6","v":0},{"$f":"'Report (Screening)'!$C$15*'Defaults 4'!$C$18/('Defaults 4'!$C$17*1000)*'Defaults 1'!J6/'Defaults 1'!B6","v":0},{"$f":"'Report (Screening)'!$C$15*'Defaults 4'!$C$23/('Defaults 4'!$C$22*1000)*'Defaults 1'!J6/'Defaults 1'!B6","v":0},{"$f":"'Report (Screening)'!$C$15*'Defaults 4'!$C$28/('Defaults 4'!$C$27*1000)*'Defaults 1'!J6/'Defaults 1'!B6","v":0},{"$f":"'Report (Screening)'!$C$15*'Defaults 4'!$C$9/('Defaults 4'!$C$12*1000)*'Defaults 1'!J6/'Defaults 1'!B6","v":0},{"$f":"'Report (Screening)'!$C$15*'Defaults 4'!$C$14/('Defaults 4'!$C$17*1000)*'Defaults 1'!J6/'Defaults 1'!B6","v":0},{"$f":"'Report (Screening)'!$C$15*'Defaults 4'!$C$19/('Defaults 4'!$C$22*1000)*'Defaults 1'!J6/'Defaults 1'!B6","v":0},{"$f":"'Report (Screening)'!$C$15*'Defaults 4'!$C$24/('Defaults 4'!$C$27*1000)*'Defaults 1'!J6/'Defaults 1'!B6","v":0},null,null,{"$f":"'Report (Screening)'!$C$15*'Defaults 4'!$C$55/'Defaults 2'!C6/'Defaults 1'!B6","v":0},{"$f":"'Report (Screening)'!$C$15*'Defaults 4'!$C$39/'Defaults 1'!B6","v":0},{"$f":"'Report (Screening)'!$C$15/'Defaults 1'!B6","v":0},{"$f":"'Report (Screening)'!$C$15*1000*'Defaults 4'!$C$30/'Defaults 4'!$C$31*0.1/0.9*'Defaults 4'!$C$32*'Defaults 4'!$C$33/1000000*1*'Defaults 1'!J6/'Defaults 1'!B6","v":0}]
["Dairy cattle",null,{"$f":"'Report (Screening)'!$C$15*'Defaults 2'!J7/'Defaults 1'!B7","v":0},{"$f":"'Report (Screening)'!$C$15*'Defaults 2'!E7/'Defaults 2'!C7/'Defaults 1'!B7","v":0},{"$f":"'Report (Screening)'!$C$15*'Defaults 2'!D7/'Defaults 2'!C7/'Defaults 1'!B7","v":0},{"$f":"'Report (Screening)'!$C$15*('Defaults 2'!E7-'Defaults 2'!D7)/'Defaults 2'!C7/'Defaults 1'!B7","v":0},{"$f":"'Report (Screening)'!$C$15*'Defaults 2'!F7/'Defaults 2'!C7/'Defaults 1'!B7","v":0},{"$f":"'Report (Screening)'!$C$15*'Defaults 3'!L7/'Defaults 1'!B7","v":0},{"$f":"'Report (Screening)'!$C$15*'Defaults 3'!M7/'Defaults 1'!B7","v":0},{"$f":"'Report (Screening)'!$C$15*'Defaults 1'!J7/'Defaults 1'!B7","v":0},{"$f":"'Report (Screening)'!$C$15*'Defaults 1'!K7/'Defaults 1'!B7","v":0},{"$f":"'Report (Screening)'!$C$15*'Defaults 4'!$C$13/('Defaults 4'!$C$12*1000)*'Defaults 1'!J7/'Defaults 1'!B7","v":0},{"$f":"'Report (Screening)'!$C$15*'Defaults 4'!$C$18/('Defaults 4'!$C$17*1000)*'Defaults 1'!J7/'Defaults 1'!B7","v":0},{"$f":"'Report (Screening)'!$C$15*'Defaults 4'!$C$23/('Defaults 4'!$C$22*1000)*'Defaults 1'!J7/'Defaults 1'!B7","v":0},{"$f":"'Report (Screening)'!$C$15*'Defaults 4'!$C$28/('Defaults 4'!$C$27*1000)*'Defaults 1'!J7/'Defaults 1'!B7","v":0},{"$f":"'Report (Screening)'!$C$15*'Defaults 4'!$C$9/('Defaults 4'!$C$12*1000)*'Defaults 1'!J7/'Defaults 1'!B7","v":0},{"$f":"'Report (Screening)'!$C$15*'Defaults 4'!$C$14/('Defaults 4'!$C$17*1000)*'Defaults 1'!J7/'Defaults 1'!B7","v":0},{"$f":"'Report (Screening)'!$C$15*'Defaults 4'!$C$19/('Defaults 4'!$C$22*1000)*'Defaults 1'!J7/'Defaults 1'!B7","v":0},{"$f":"'Report (Screening)'!$C$15*'Defaults 4'!$C$24/('Defaults 4'!$C$27*1000)*'Defaults 1'!J7/'Defaults 1'!B7","v":0},{"$f":"'Report (Screening)'!$C$15*'Defaults 4'!$C$35/'Defaults 1'!B7","v":0},{"$f":"'Report (Screening)'!$C$15*'Defaults 4'!$C$35/20","v":0},{"$f":"'Report (Screening)'!$C$15*'Defaults 4'!$C$55/'Defaults 2'!C7/'Defaults 1'!B7","v":0},{"$f":"'Report (Screening)'!$C$15*'Defaults 4'!$C$39/'Defaults 1'!B7","v":0},{"$f":"'Report (Screening)'!$C$15/'Defaults 1'!B7","v":0},{"$f":"'Report (Screening)'!$C$15*1000*'Defaults 4'!$C$30/'Defaults 4'!$C$31*0.1/0.9*'Defaults 4'!$C$32*'Defaults 4'!$C$33/1000000*1*'Defaults 1'!J7/'Defaults 1'!B7","v":0}]
{"$rows_left_out":32}
{"sheet":"Calc (Realistic worst case)","index":6,"n_rows":102,"n_cols":9,"rows_kept":102,"cut":false,"hidden":false,"merged":[]}
["Realistic Worst-case Scenarios (mg a.s./kg bw/d)"]
[]
["Oral Scenarios"]
["Animal Species",null,"Oral - Animals licking surfaces","Oral - Uptake of feed (treatment of surfaces surrounding trough)","Oral - Uptake of feed (direct treatment of trough)","Oral - Uptake of feed contaminated  via packaging material","Oral - Chewing on wooden stall edgings","Oral - Ingestion of dead insects (poultry only)","Sum Oral"]
["Beef cattle"," - ",null,{"$f":"'Report (Realistic worst case)'!$C$16*'Defaults 4'!$C$6*'Defaults 2'!M6/'Defaults 1'!B6*'Report (Realistic worst case)'!$E$16","v":0},{"$f":"'Report (Realistic worst case)'!$C$17*'Defaults 2'!L6/'Defaults 1'!B6*'Report (Realistic worst case)'!$E$17","v":0},{"$f":"'Report (Realistic worst case)'!$C$18*'Defaults 1'!J6*'Defaults 4'!$C$34/'Defaults 1'!B6*'Report (Realistic worst case)'!$E$18","v":0},null,null,{"$f":"SUM(C5:H5)","v":0}]
["Dairy cattle"," - ",null,{"$f":"'Report (Realistic worst case)'!$C$16*'Defaults 4'!$C$6*'Defaults 2'!M7/'Defaults 1'!B7*'Report (Realistic worst case)'!$E$16","v":0},{"$f":"'Report (Realistic worst case)'!$C$17*'Defaults 2'!L7/'Defaults 1'!B7*'Report (Realistic worst case)'!$E$17","v":0},{"$f":"'Report (Realistic worst case)'!$C$18*'Defaults 1'!J7*'Defaults 4'!$C$34/'Defaults 1'!B7*'Report (Realistic worst case)'!$E$18","v":0},null,null,{"$f":"SUM(C6:H6)","v":0}]
{"$rows_left_out":97}
{"sheet":"Calc (WCCE)","index":7,"n_rows":127,"n_cols":10,"rows_kept":127,"cut":false,"hidden":false,"merged":[[3,0,3,6],[17,0,17,5],[55,0,55,13],[90,0,90,5],[91,2,91,3],[91,4,91,5],[18,2,18,3],[18,4,18,5],[86,1,86,6],[59,4,59,9]]}
["Worst Case Consumer Exposure (mg a.s./kg bw/d)"]
[]
[]
["Highest estimated livestock exposure (RWCE) values "]
["Animal group","Animal Species","Housing condition","Sum of \nall routes of exposure","Sum of \nall oral routes of exposure","Sum of \nall dermal routes of exposure","Sum of \nall inhalative routes of exposure"]
["All animals",{"$f":"INDEX('Report (Realistic worst case)'!$A$90:$A$111,MATCH(D6,'Report (Realistic worst case)'!$C$90:$C$111,0))","v":{"$error":"#N/A"}},{"$f":"INDEX('Report (Realistic worst case)'!$B$90:$B$111,MATCH(D6,'Report (Realistic worst case)'!$C$90:$C$111,0))","v":{"$error":"#N/A"}},{"$f":"MAX('Report (Realistic worst case)'!C90:C111)","v":0},{"$f":"VLOOKUP(B6&C6,CHOOSE({1,2},'Calc (Realistic worst case)'!$A$5:$A$26&'Calc (Realistic worst case)'!$B$5:$B$26,'Calc (Realistic worst case)'!$I$5:$I$26),2,0)","v":{"$error":"#N/A"}},{"$f":"VLOOKUP(B6&C6,CHOOSE({1,2},'Calc (Realistic worst case)'!$A$37:$A$59&'Calc (Realistic worst case)'!$B$37:$B$59,'Calc (Realistic worst case)'!$F$37:$F$59),2,0)","v":{"$error":"#N/A"}},{"$f":"VLOOKUP(B6&C6,CHOOSE({1,2},'Calc (Realistic worst case)'!$A$72:$A$93&'Calc (Realistic worst case)'!$B$72:$B$93,'Calc (Realistic worst case)'!$E$72:$E$93),2,0)","v":{"$error":"#N/A"}}]
{"$rows_left_out":122}
{"sheet":"Defaults 1","index":8,"n_rows":19,"n_cols":11,"rows_kept":19,"cut":false,"hidden":false,"merged":[[3,2,3,4],[0,0,0,7]]}
["Default Values (1): Animal Size and Physiology (except fish)\n"]
["(Guidance on the Biocidal Products Regulation, Vol III Parts B+C, Section 6: Guidance on estimating livestock exposure, Appendix 6-1, Table 52)"]
[]
["Animal Species","Body weight (kg)","Animal height (cm)",null,null,"Body surface area (m2) ","Body surface area in contact with surface (m2) ","Alveolar ventilation rate (l/h) ","Alveolar ventilation rate (m3/d)","Feed intake (kg/day) ","Drinking water intake (l/d) "]
[null,null,"Height to withers or shoulder","height to top of head","maximum reaching height","calculated from default bw","(30% of total body surface area)","resting AVR calculated from default bw, to account for activity use a correction factor of 3","resting AVR calculated from default bw, to account for activity use a correction factor of 3","based on default bw","based on default bw"]
["Beef cattle",500,145,161,177,4.8,1.44,2110,51,12,50]
{"$rows_left_out":14}
{"sheet":"Defaults 2","index":9,"n_rows":30,"n_cols":19,"rows_kept":30,"cut":false,"hidden":false,"merged":[[3,7,3,8],[3,9,3,10],[3,13,3,14],[3,15,3,16],[3,17,3,18],[3,11,3,12]]}
["Default Values (2):  Animal housing"]
["(Guidance on the Biocidal Products Regulation, Vol III Parts B+C, Section 6: Guidance on estimating livestock exposure, Appendix 6-1, Table 53)"]
[]
["Animal Species","Housing type","Number of animals per stable","Floor area per stable (m2)","Wall and floor area per stable (m2)","Housing volume per stable (m3)","Floor area per animal (m2)","Maximum area (wall) within reach of animal (m2) ",null,"Maximum area within reach of animal (wall+floor) (m2) ",null,"Exposed feed surface (m2)",null,"Ventilation rate housing (m³/h)\nper 500 kg live weight",null,"Ventilation rate housing (m³/h)\nper animal",null,"Ventilation rate housing (1/h)\nair exchanges per hour "]
[null,null,"for rabbits per cage","for rabbits per cage","for rabbits per cage","for rabbits per cage",null,"considering max reaching height","No of compartmentwalls considered","considering max reaching height","No of compartmentwalls considered","in case of direct treatment of troughs","in case of treatment of surfaces surrounding troughs","Winter min","Summer max ","Winter min","Summer max ","Winter min","Summer max "]
["Beef cattle",null,125,370,1000,3063,2.96,10.8,3,13.7,3,2.6,0.7,50,333,50,333,2,13.6]
{"$rows_left_out":25}
{"sheet":"Defaults 3","index":10,"n_rows":20,"n_cols":14,"rows_kept":20,"cut":false,"hidden":false,"merged":[[3,1,3,3],[3,4,3,6],[3,7,3,9],[5,13,18,13]]}
["Default Values (3):  Animal transport"]
["(Guidance on the Biocidal Products Regulation, Vol III Parts B+C, Section 6: Guidance on estimating livestock exposure, Appendix 6-1, Table 54)"]
[]
["Animal Species","Time spent in transport vehicles (h)",null,null,"Truck\n(Default truck of 7.0m x 2.5 m)",null,null,"Compartment",null,null,"Required floor area per animal during transport (m2)","Available wall+floor area per animal (m2) ","Available volume per animal (m3)","Ventilation rate "]
[null,"transport","resting period ","transport","No of floors","No of compartments per floor","No of animals per compartment","Length (m)","Width (m)","relevant height (m)",null,"within a compartment","within a truck of 7.0m x 2.5 m","\n"]
["Beef cattle",14,1,14,1,2,6,3.5,2.5,1.8,1.35,5.0999999999999996,2.6,"Forced ventilation systems\n\n60 m3/h/kN loading capacity (with 1000 kg = 9.80665 kN) and a temperature between 5-30°C"]
{"$rows_left_out":15}
{"sheet":"Defaults 4","index":11,"n_rows":63,"n_cols":4,"rows_kept":63,"cut":false,"hidden":false,"merged":[]}
["Default Values (4):  Miscellaneous values"]
["(Guidance on the Biocidal Products Regulation, Vol III Parts B+C, Section 6: Guidance on estimating livestock exposure, Appendix 6-1, Table 55)"]
[]
["Animal Species\n(if relevant for exposure scenario)","Description","Default","Background Information \nRemarks"]
["/","emission factor for spraying (fraction emitted to the treated surface during surface treatment by spraying)",0.85,"Table 55, line 18"]
["/","emission factor for spraying (fraction emitted to floor during surface treatment by spraying)",0.11,"Table 55, line 18"]
{"$rows_left_out":58}
{"sheet":"Defaults 5 Food Cons.","index":12,"n_rows":81,"n_cols":10,"rows_kept":81,"cut":false,"hidden":false,"merged":[[5,2,5,3],[5,4,5,9],[47,2,47,3],[47,4,47,9]]}
["Default Values (5):  Food consumption data (chronic and acute)"]
["Regulation (EU) 2018/782. Annex II. Derivation of numerical MRLs  (with regard to Regulation (EC) No 470/2009) "]
["EFSA, 2018. Guidance document on the use of the EFSA Pesticide Residue Intake Model (EFSA PRIMo revision 3.1). "]
[]
["Food consumption data (chronic)"]
["Consumer intake model",null,"EMA Food basket*\n(max. daily intake)",null,"EFSA PRIMo rev 3.1\n(max. daily intake)"]
{"$rows_left_out":76}
{"sheet":"Defaults 6 LogP_OW","index":13,"n_rows":17,"n_cols":7,"rows_kept":17,"cut":false,"hidden":false,"merged":[]}
["Default Values (6):  Transfer factor based on the octanol–water partition coefficient (LogPOW)"]
["W. R. Leeman, K. J. Van Den Berg & G. F. Houben (2007) Transfer of chemicals from feed to animal products: The use of transfer factors in risk assessment, Food Additives & Contaminants, 24:1, 1-13, DOI: 10.1080/02652030600815512"]
[]
["LogPOW","Eggs","Milk","Muscle","Fat","Liver","Kidney"]
["<0",0.03,0.02,0.02,0.01,0.02,0.02]
["0–1",0.05,0.03,0.04,0.01,0.3,0.3]
{"$rows_left_out":12}
{"sheet":"Refinement Notes Inhalation ","index":14,"n_rows":20,"n_cols":3,"rows_kept":20,"cut":false,"hidden":false,"merged":[[1,0,1,8]]}
["Refinement of inhalation exposure estimate for livestock animals using ConsExpo Web "]
["According to the Guidance on estimating livestock exposure (1) in tier 1 inhalation exposure of livestock animals is estimated using the SVC model, which assumes as worst case that livestock animals are exposed to air containing the active substance at its saturated vapor concentration (SVC). For biocide applications in animal housing this usually results in an overestimation of livestock inhalative exposure. \n\nAs tier 2 the estimation of inhalation exposure may be refined considering more realistic conditions in animal housing such as the amount of biocidal product applied, room volume and room ventilation rates. As an option inhalation exposure may be refined using the ConsExpo Web modelling tool (3) together with livestock specific data as provided in the Guidance on estimating livestock exposure (1). \n\nIn the table below information is given on the input data necessary to perform inhalation exposure estimates in ConsExpo. "]
["Parameter","Remarks","Reference"]
["ConsExpo models","Inhalation: Exposure to vapour \n– constant rate\n– evaporation release mode","ConsExpo Web, Consumer Exposure models, model documentation, Update for ConsExpo Web 1.0.2, section 4.1.1, p. 31 (3)\nhttps://www.rivm.nl/bibliotheek/rapporten/2017-0197.pdf"]
["vapour pressure and related temperature","substance specific value","active substance CAR"]
["molecular weight","substance specific value","active substance CAR"]
{"$rows_left_out":14}